Fruit
type: Concept
label: Obst @de
broader: http://zbw.eu/beta/pm20voc/pr/i/72235
in scheme: pr
notation: LW04-Ob
scope note: (einschl.: Frucht, Beerenobst, Steinobst, Kernobst) @de
NotationLong: LW04-Ob

NotationLong
sub property of: notation
definition: EXPERIMENTAL: Notation with blanks and leading zeros for sortability.