NotationLong
sub property of: notation
definition: EXPERIMENTAL: Notation with blanks and leading zeros for sortability. @en

Private Haushalte mit Hauspersonal ...
type: Concept
broader: http://zbw.eu/beta/pm20voc/na/i/183951
notation: NA T
scope note: Private Haushalte mit Hauspersonal; Herstellung von Waren und Erbringung von Dienstleistungen durch private Haushalte für den Eigenbedarf ohne ausgeprägten Schwerpunkt
NotationLong: NA T
in scheme: na
narrower: http://zbw.eu/beta/pm20voc/na/i/183715