NotationLong
sub property of: notation
definition: EXPERIMENTAL: Notation with blanks and leading zeros for sortability.

Sea border slaughterhouses
preferred label: Seegrenzschlachthöfe @de
subject of: about
NotationLong: g 04 SM 501 (A 010)
in scheme: subject
type: Concept
scope note: (einschl.: nur für Hafenstädte in Deutschland (A 10)) @de
notation: g4 Sm501 (A10)
broader: Trade policy, Foreign economic policy, general

Trade policy, Foreign economic policy, general
notation: g4
label: Handelspolitik, Auswärtige Wirtschaftspolitik, Allgemein @de
type: Concept
narrower: Sea border slaughterhouses