Churches, schools and associations ... of minorities, general
broader: Minorities from individual countries
type: Concept
note: folderCount: 3
label: Minderheiten Kirchen, Schulen und Vereine ..., Allgemein @de
scope note: früher: nichtdeutsche Kirchen, Schulen und Vereine..., Allgemein @de
editorial note: Schlagwort (geographisch) @de
notation: o3 Sm1 (alt)
subject of: about
NotationLong: o 03 SM 001 (alt)
in scheme: subject
folder count: 3

NotationLong
sub property of: notation
definition: EXPERIMENTAL: Notation with blanks and leading zeros for sortability.

Minorities from individual countries
notation: o3
label: Minderheiten aus einzelnen Ländern @de
type: Concept
narrower: Churches, schools and associations ... of minorities, general