Special roads for automobiles, general
scope note: (einschl.: Autobahn; Reichsautobahn;) @de
gnd identifier: 4057931-1
gnd identifier: 4057883-5
gnd identifier: 4003936-5
label: Autospezialstrassen, Allgemein @de
NotationLong: n 29 SM 001
in scheme: subject
note: folderCount: 6
notation: n29 Sm1
folder count: 6
subject of: about
type: Concept
broader: Roads, paths, bridges (including their traffic)

NotationLong
sub property of: notation
definition: EXPERIMENTAL: Notation with blanks and leading zeros for sortability.

Roads, paths, bridges (including their traffic)
notation: n29
label: Landstrassen, Wege, Brücken (einschl. ihres Verkehrs) @de
type: Concept
narrower: Special roads for automobiles, general