NotationLong
sub property of: notation
definition: EXPERIMENTAL: Notation with blanks and leading zeros for sortability.

Integration with foreign industry, general
preferred label: Verflechtung mit der Industrie des Auslandes, Allgemein @de
type: Concept
notation: n13 Sm12.I
scope note: Beziehungen zur Industrie des Auslandes @de
note: folderCount: 4
broader: Integration / relationships with foreign industry
gnd identifier: 4078604-3
subject of: about
in scheme: subject
NotationLong: n 13 SM 012.01
folder count: 4

Integration / relationships with foreign industry
notation: n13 Sm12
label: Verflechtung mit der / Beziehungen zur Industrie des Auslandes @de
type: Concept
narrower: Integration with foreign industry, general