NotationLong
sub property of: notation
definition: EXPERIMENTAL: Notation with blanks and leading zeros for sortability.

Higher Education, Research Institutes, general
notation: k1
label: Hochschulwesen, Forschungsanstalten Allgemein @de
type: Concept
narrower: Adult education centers

Adult education centers
preferred label: Volkshochschulen @de
gnd identifier: 4136151-9
gnd identifier: 4136150-7
gnd identifier: 4184808-1
in scheme: subject
broader: Higher Education, Research Institutes, general
notation: k1 Sm3
subject of: about
type: Concept
folder count: 2
note: folderCount: 2
NotationLong: k 01 SM 003
scope note: (einschl.: Volkshochschulwesen, Volksuniversitätswesen, freie Erwachsenenbildung, Fernstudium) @de