NotationLong
sub property of: notation
definition: EXPERIMENTAL: Notation with blanks and leading zeros for sortability.

Economic war, confiscation, forced administration and liquidation of property of foreign individuals
note: folderCount: 23
scope note: (einschl.: Beschlagnahme, Zwangsverwaltung und Liquidation) @de
label: Wirtschaftskrieg, Beschlagnahme, Zwangsverwaltung und Liquidation von Eigentum der Angehörigen einzelner Länder @de
notation: g4 Sm2.IIIb
in scheme: subject
type: Concept
subject of: about
folder count: 23
NotationLong: g 04 SM 002.03b
broader: Economic war, confiscation, forced administration and liquidation

Economic war, confiscation, forced administration and liquidation
notation: g4 Sm2.III
label: Wirtschaftskrieg, Beschlagnahme, Zwangsverwaltung und Liquidation @de
type: Concept
narrower: Economic war, confiscation, forced administration and liquidation of property of foreign individuals