Workers' and Economic Councils
notation: f4 Sm502 (A10)
label: Arbeiter- und Wirtschaftsräte @de
type: Concept
narrower: Workers' and economic councils, general

NotationLong
sub property of: notation
definition: EXPERIMENTAL: Notation with blanks and leading zeros for sortability.

Workers' and economic councils, general
broader: Workers' and Economic Councils
folder count: 1
note: folderCount: 1
preferred label: Arbeiter- und Wirtschaftsräte, Allgemein @de
type: Concept
NotationLong: f 04 SM 502.01 (A 010)
notation: f4 Sm502.I (A10)
in scheme: subject
gnd identifier: 4633876-7
gnd identifier: 4784225-8
gnd identifier: 4048262-5
scope note: Art. 130, 365 der Weimarer Verfassung @de
subject of: about