Racism, Nazi eugenics
NotationLong: d 00 SM 001
label: Rassismus, Eugenik, NS-Rassenhygiene (-1945) @de
in scheme: subject
scope note: In der alten Hamburger Systematik unter "Erhaltung und Reinerhaltung der Rasse, Rassenhygiene" @de
broader: Population and population policies
notation: d Sm1
folder count: 7
subject of: about
note: folderCount: 7
type: Concept

NotationLong
sub property of: notation
definition: EXPERIMENTAL: Notation with blanks and leading zeros for sortability.

Population and population policies
notation: d
label: Bevölkerung und Bevölkerungspolitik @de
type: Concept
narrower: Racism, Nazi eugenics