NotationLong
sub property of: notation
definition: EXPERIMENTAL: Notation with blanks and leading zeros for sortability.

Individual questions of political or economic nature
type: Concept
notation: q
label: Einzelfragen politischer und wirtschaftlicher Natur @de
narrower: The little entente

The little entente
type: Concept
broader: Individual questions of political or economic nature
label: Die kleine Entente @de
scope note: politisches und militärisches Bündnissystem zwischen der Tschechoslowakei und dem späteren Jugoslawien sowie Rumänien @de
NotationLong: q SM 501 (A 001)
gnd identifier: 4164106-1
in scheme: subject
folder count: 1
subject of: about
note: folderCount: 1
notation: q Sm501 (A1)