NotationLong
sub property of: notation
definition: EXPERIMENTAL: Notation with blanks and leading zeros for sortability.

Individual questions of political or economic nature
type: Concept
notation: q
label: Einzelfragen politischer und wirtschaftlicher Natur @de
narrower: Special position of the whites

Special position of the whites
type: Concept
preferred label: Sonderstellung der Weissen @de
broader: Individual questions of political or economic nature
folder count: 4
in scheme: subject
note: folderCount: 4
NotationLong: q SM 025
scope note: in Ländern mit starker Eingeborenen-Bevölkerung @de
notation: q Sm25
subject of: about