Individual inland waterways and sea canals
type: Concept
notation: n33a
label: Einzelne Binnenschiffahrtsstrassen und Seekanäle @de
narrower: Individual inland waterways and sea canals, general

Individual inland waterways and sea canals, general
type: Concept
note: folderCount: 2
broader: Individual inland waterways and sea canals
subject of: about
label: Einzelne Binnenschiffahrtsstrassen und Seekanäle, Allg @de
scope note: einschl. Wasserwirtschaftliches und Schiffahrt @de
in scheme: subject
gnd identifier: 4029459-6
gnd identifier: 4006761-0
folder count: 2
NotationLong: n 33a SM 001
notation: n33a Sm1

NotationLong
sub property of: notation
definition: EXPERIMENTAL: Notation with blanks and leading zeros for sortability.