Land ownership and policies, home ownership
type: Concept
notation: n3
label: Bodenbesitzverhältnisse und Bodenpolitik, Hausbesitz @de
narrower: Land prices (overviews)

Land prices (overviews)
type: Concept
broader: Land ownership and policies, home ownership
preferred label: Bodenpreise (Übersichten) @de
gnd identifier: 4066517-3
gnd identifier: 4056995-0
gnd identifier: 4138280-8
gnd identifier: 4158416-8
notation: n3 Sm6
folder count: 4
note: folderCount: 4
in scheme: subject
NotationLong: n 03 SM 006
subject of: about
scope note: Bewertung des Bodens, Schätzungen des Bodenwerts @de

NotationLong
sub property of: notation
definition: EXPERIMENTAL: Notation with blanks and leading zeros for sortability.