Party system
type: Concept
notation: f5
label: Parteiwesen @de
narrower: Individual political movements

Individual political movements
type: Concept
note: folderCount: 3
in scheme: subject
NotationLong: f 05 SM 002
subject of: about
editorial note: Schlagwortvergabe @de
preferred label: Einzelne politische Strömungen @de
scope note: 1946-1960 bzw.1970: geändert in: Einzelne politische Strömungen. Nicht lizensierte Parteien. Politische Untergrundorganisationen. Nur Hamburg (A 9), Deutschland (A 10), Berlin (A 10(Bln)), DDR (A 10 (A50)) - bis 1960. Für die übrigen Länder bis 1970. - Ab 1975: geändert in: Extremistische politische Gruppierungen und Untergrundorganisationen @de
broader: Party system
notation: f5 Sm2
folder count: 3

NotationLong
sub property of: notation
definition: EXPERIMENTAL: Notation with blanks and leading zeros for sortability.