Historical events
type: Concept
notation: f2
label: Geschichtliche Vorgänge @de
narrower: Anti-communism and anti-Bolshevik propaganda (-1945)

Anti-communism and anti-Bolshevik propaganda (-1945)
type: Concept
subject of: about
NotationLong: f 02 SM 007 (alt)
gnd identifier: 4127664-4
gnd identifier: 4031892-8
gnd identifier: 4077548-3
gnd identifier: 4037765-9
gnd identifier: 4065109-5
gnd identifier: 4056883-0
gnd identifier: 4173414-2
gnd identifier: 4002291-2
gnd identifier: 4167363-3
preferred label: Antibolschewismus und Antikommunismus (-1945) @de
note: folderCount: 18
notation: f2 Sm7 (alt)
scope note: In der alten Hamburger Systematik unter "Bolschewismus und seine Bekämpfung" @de
broader: Historical events
in scheme: subject
folder count: 18

NotationLong
sub property of: notation
definition: EXPERIMENTAL: Notation with blanks and leading zeros for sortability.