NotationLong
sub property of: notation
definition: EXPERIMENTAL: Notation with blanks and leading zeros for sortability.

Science and education, general
type: Concept
label: Wissenschaft und Bildungswesen, Allgemein @de
narrower: Central office of the Hamburg Colonial Institute
notation: k

Central office of the Hamburg Colonial Institute
type: Concept
subject of: about
label: Zentralstelle des Hamburgischen Kolonialinstitutes @de
broader: Science and education, general
in scheme: subject
notation: k Sm501 (A9)
note: folderCount: 1
scope note: (einschl.: Hamburgisches Welt Wirtschafts Archiv; Hamburgisches Welt Wirtschafts Institut) @de
folder count: 1
NotationLong: k 00 SM 501 (A 009)
gnd identifier: 4073624-6
gnd identifier: 4621216-4
gnd identifier: 4419791-3