NotationLong
sub property of: notation
definition: EXPERIMENTAL: Notation with blanks and leading zeros for sortability.

Trade policy, Foreign economic policy, general
type: Concept
label: Handelspolitik, Auswärtige Wirtschaftspolitik, Allgemein @de
narrower: Sea border slaughterhouses
notation: g4

Sea border slaughterhouses
type: Concept
subject of: about
label: Seegrenzschlachthöfe @de
broader: Trade policy, Foreign economic policy, general
in scheme: subject
notation: g4 Sm501 (A10)
scope note: (einschl.: nur für Hafenstädte in Deutschland (A 10)) @de
NotationLong: g 04 SM 501 (A 010)