NotationLong
sub property of: notation
definition: EXPERIMENTAL: Notation with blanks and leading zeros for sortability.

Reparations Commission, activities of general agents for reparation payments
type: Concept
subject of: about
label: Reparationskommission, Tätigkeit der Generalagenten für Reparationszahlungen @de
broader: Reparations Commission, activity
in scheme: subject
notation: q Sm504.IIb4 (A10)
scope note: einschl. der Kommissare und Treuhänder @de
NotationLong: q SM 504.02b4 (A 010)

Reparations Commission, activity
type: Concept
label: Reparationskommission, Tätigkeit @de
narrower: Reparations Commission, activities of general agents for reparation payments
notation: q Sm504.IIb (A10)