NotationLong
sub property of: notation
definition: EXPERIMENTAL: Notation with blanks and leading zeros for sortability.

Roads, paths, bridges (including their traffic)
type: Concept
label: Landstrassen, Wege, Brücken (einschl. ihres Verkehrs) @de
narrower: Special roads for automobiles, general
notation: n29

Special roads for automobiles, general
type: Concept
subject of: about
label: Autospezialstrassen, Allgemein @de
broader: Roads, paths, bridges (including their traffic)
in scheme: subject
notation: n29 Sm1
note: folderCount: 6
scope note: (einschl.: Autobahn; Reichsautobahn;) @de
folder count: 6
NotationLong: n 29 SM 001
gnd identifier: 4057931-1
gnd identifier: 4057883-5
gnd identifier: 4003936-5