NotationLong
sub property of: notation
definition: EXPERIMENTAL: Notation with blanks and leading zeros for sortability.

Credit and banking
type: Concept
label: Kreditwesen und Bankwesen @de
narrower: Norman plan
notation: n24

Norman plan
type: Concept
subject of: about
label: Norman Plan @de
broader: Credit and banking
in scheme: subject
notation: n24 Sm503 (H)
scope note: Internationale Industriefinanzierung und Geldmarkt Drainage, Franqui Plan @de
NotationLong: n 24 SM 503 (H)