NotationLong
sub property of: notation
definition: EXPERIMENTAL: Notation with blanks and leading zeros for sortability.

Integration with foreign industry, general
type: Concept
subject of: about
label: Verflechtung mit der Industrie des Auslandes, Allgemein @de
broader: Integration / relationships with foreign industry
in scheme: subject
notation: n13 Sm12.I
note: folderCount: 4
scope note: Beziehungen zur Industrie des Auslandes @de
folder count: 4
NotationLong: n 13 SM 012.01
gnd identifier: 4078604-3

Integration / relationships with foreign industry
type: Concept
label: Verflechtung mit der / Beziehungen zur Industrie des Auslandes @de
narrower: Integration with foreign industry, general
notation: n13 Sm12