NotationLong
sub property of: notation
definition: EXPERIMENTAL: Notation with blanks and leading zeros for sortability.

Higher Education, Research Institutes, general
type: Concept
label: Hochschulwesen, Forschungsanstalten Allgemein @de
narrower: Adult education centers
notation: k1

Adult education centers
type: Concept
subject of: about
label: Volkshochschulen @de
broader: Higher Education, Research Institutes, general
in scheme: subject
notation: k1 Sm3
note: folderCount: 2
scope note: (einschl.: Volkshochschulwesen, Volksuniversitätswesen, freie Erwachsenenbildung, Fernstudium) @de
folder count: 2
NotationLong: k 01 SM 003
gnd identifier: 4136151-9
gnd identifier: 4136150-7
gnd identifier: 4184808-1