NotationLong
sub property of: notation
definition: EXPERIMENTAL: Notation with blanks and leading zeros for sortability.

Population and population policies
type: Concept
label: Bevölkerung und Bevölkerungspolitik @de
narrower: Racism, Nazi eugenics
notation: d

Racism, Nazi eugenics
type: Concept
subject of: about
label: Rassismus, Eugenik, NS-Rassenhygiene (-1945) @de
broader: Population and population policies
in scheme: subject
notation: d Sm1
note: folderCount: 7
scope note: In der alten Hamburger Systematik unter "Erhaltung und Reinerhaltung der Rasse, Rassenhygiene" @de
folder count: 7
NotationLong: d 00 SM 001