Mining Products
notation: PRB02
label: Bergbauprodukte @de
type: Concept
narrower: Propellant

NotationLong
sub property of: notation
definition: EXPERIMENTAL: Notation with blanks and leading zeros for sortability.

Propellant
preferred label: Treibgas @de
subject of: about
notation: PRB02.05-Fg01
NotationLong: PRB02.05-Fg01
wikipedia article: Treibgas
in scheme: ware
scope note: Unter Treibgasen versteht man allgemein verflüssigte oder verdichtete Gase oder Stoffe. Sie finden bei Verbrennungsprozessen (Druckgas)Verwendung, fungieren als Komponente in Spraydosen oder als Aufschäummittel für Kunststoffe/Lebensmittel. Treibgase sollen keine chemischen Reaktionen mit dem Inhalt eingehen. Einige der bekanntesten Treibgases sind: FCKW (Trichlorfluormethan, Dichlordifluormethan), Kohlenwasserstoffe (Propan, Butan), Kohlendioxid, Stickstoff und Luft. @de
type: Concept
broader: Mining Products