Naphthalene
notation: PRB02.08-04
subject of: about
label: Naphthalin @de
type: Concept
wikipedia article: Naphthalene
wikipedia article: Naphthalin
scope note: Naphthalin (von griechisch naphtha = Erdöl) ist ein weißer Feststoff mit der Summenformel C10H8, der schon bei Raumtemperatur sublimiert. Es ist ein bicyclischer aromatischer Kohlenwasserstoff mit charakteristischem Geruch nach Teer. Naphthalin ist gesundheitsschädlich und umweltgefährlich. @de
in scheme: ware
NotationLong: 20.14.0-46
broader: Mining Products

Mining Products
notation: PRB02
label: Bergbauprodukte @de
type: Concept
narrower: Naphthalene

NotationLong
sub property of: notation
definition: EXPERIMENTAL: Notation with blanks and leading zeros for sortability.