Meerschaum
notation: PRB02.08-02
broader: Mining Products
subject of: about
NotationLong: 08.99.0-07
type: Concept
in scheme: ware
scope note: Meerschaum oder auch Sepiolith ist ein eher seltenes Tonmineral aus der Gruppe der Silikate, chemisch gesehen hydratisiertes Magnesiumsilikat. @de

Mining Products
notation: PRB02
label: Bergbauprodukte @de
type: Concept
narrower: Meerschaum

NotationLong
sub property of: notation
definition: EXPERIMENTAL: Notation with blanks and leading zeros for sortability.