Solvent
type: Concept
notation: PID13-Ko
label: Lösungsmittel @de
narrower: Turpentine

Turpentine
type: Concept
subject of: about
preferred label: Terpentin @de
wikipedia article: Turpentine
wikipedia article: Terpentin
notation: PID13-Ko06
broader: Solvent
scope note: Terpentin (Terpentinöl, Terpentinspiritus, Balsamöl, Kiefernöl) nennt man die frischen, durch Lufteinwirkung noch nicht veränderten Harzausflüsse verschiedener Koniferen, besonders Kiefern (Pinus), die als Gemische von Harz und ätherischen Ölen zu den Balsamen gehören und erst beim Eintrocknen unter Verlust der flüchtigen Stoffe in Harz übergehen. Terpentin ist eine farblose bis gelbliche, meist cremige, Flüssigkeit. @de
NotationLong: PID13-Ko06
in scheme: ware

NotationLong
sub property of: notation
definition: EXPERIMENTAL: Notation with blanks and leading zeros for sortability.