NotationLong
sub property of: notation
definition: EXPERIMENTAL: Notation with blanks and leading zeros for sortability. @en

Wachs
type: Concept
notation: PID13-Wa
label: Wax @en
narrower: Stearin

Stearin
type: Concept
scope note: Stearin ist ein Gemisch aus Stearin- und Palmitinsäure mit der allgemeinen Summenformel C17H35COOH. Es wird u. a. benutzt, um Kerzen herzustellen. Im Gegensatz zu Paraffin, das ein Nebenprodukt aus der Erdölverarbeitung ist, wird Stearin hauptsächlich aus pflanzlichem (Palmöl) oder tierischem Fett gewonnen. Es ist biologisch abbaubar. Stearin wurde 1818 als geeigneter Kerzenrohstoff entdeckt.
notation: PID13-Wa07
in scheme: ware
NotationLong: 20.14.0-34
subject of: about
broader: Wachs
wikipedia article: Stearin