NotationLong
sub property of: notation
definition: EXPERIMENTAL: Notation with blanks and leading zeros for sortability.

Propellant
type: Concept
subject of: about
wikipedia article: Treibgas
label: Treibgas @de
broader: Mining Products
in scheme: ware
notation: PRB02.05-Fg01
scope note: Unter Treibgasen versteht man allgemein verflüssigte oder verdichtete Gase oder Stoffe. Sie finden bei Verbrennungsprozessen (Druckgas)Verwendung, fungieren als Komponente in Spraydosen oder als Aufschäummittel für Kunststoffe/Lebensmittel. Treibgase sollen keine chemischen Reaktionen mit dem Inhalt eingehen. Einige der bekanntesten Treibgases sind: FCKW (Trichlorfluormethan, Dichlordifluormethan), Kohlenwasserstoffe (Propan, Butan), Kohlendioxid, Stickstoff und Luft. @de
NotationLong: PRB02.05-Fg01

Mining Products
type: Concept
label: Bergbauprodukte @de
narrower: Propellant
notation: PRB02