NotationLong
sub property of: notation
definition: EXPERIMENTAL: Notation with blanks and leading zeros for sortability. @en

Stearin
type: Concept
subject of: about
wikipedia article: Stearin
broader: Wachs
in scheme: ware
notation: PID13-Wa07
scope note: Stearin ist ein Gemisch aus Stearin- und Palmitinsäure mit der allgemeinen Summenformel C17H35COOH. Es wird u. a. benutzt, um Kerzen herzustellen. Im Gegensatz zu Paraffin, das ein Nebenprodukt aus der Erdölverarbeitung ist, wird Stearin hauptsächlich aus pflanzlichem (Palmöl) oder tierischem Fett gewonnen. Es ist biologisch abbaubar. Stearin wurde 1818 als geeigneter Kerzenrohstoff entdeckt.
NotationLong: 20.14.0-34

Wachs
type: Concept
label: Wax @en
narrower: Stearin
notation: PID13-Wa