NotationLong
sub property of: notation
definition: EXPERIMENTAL: Notation with blanks and leading zeros for sortability.

Meerschaum
type: Concept
subject of: about
broader: Mining Products
in scheme: ware
notation: PRB02.08-02
scope note: Meerschaum oder auch Sepiolith ist ein eher seltenes Tonmineral aus der Gruppe der Silikate, chemisch gesehen hydratisiertes Magnesiumsilikat. @de
NotationLong: 08.99.0-07

Mining Products
type: Concept
label: Bergbauprodukte @de
narrower: Meerschaum
notation: PRB02