Africa
notation: C1
label: Afrika @de
type: Concept
narrower: East Africa

NotationLong
sub property of: notation
definition: EXPERIMENTAL: Notation with blanks and leading zeros for sortability.

East Africa
gnd identifier: 4075722-5
NotationLong: C 006
broader: Africa
wikipedia article: East Africa
wikipedia article: Ostafrika
subject of: about
label: Ostafrika @de
notation: C6
type: Concept
scope note: (einschl.: Burundi, Kenia, Rwanda, Tansania, Uganda) @de
in scheme: geo