Australia
note: waFolderCount: 38
note: shFolderCount: 80
in scheme: geo
gnd identifier: 4003900-6
sh folder count: 80
type: Concept
scope note: Australischer Staatenbund m. Tasmanien @de
wikipedia article: Australia
wikipedia article: Australien
preferred label: Australien @de
broader: Australia and Oceania
subject of: about
notation: D30
wa folder count: 38
NotationLong: D 030
folders complete: N

Australia and Oceania
notation: D1
label: Australien und südpazifischer Inselraum @de
type: Concept
narrower: Australia

NotationLong
sub property of: notation
definition: EXPERIMENTAL: Notation with blanks and leading zeros for sortability.