Australia and Oceania
notation: D1
label: Australien und südpazifischer Inselraum @de
type: Concept
narrower: Solomon Islands and Bismarck Archipelago

NotationLong
sub property of: notation
definition: EXPERIMENTAL: Notation with blanks and leading zeros for sortability.

Solomon Islands and Bismarck Archipelago
gnd identifier: 4076974-4
gnd identifier: 4080417-3
label: Salomoninseln und Bismarck-Archipel @de
folders complete: Y
subject of: about
broader: Australia and Oceania
scope note: Bismarck Archipel, Neu-Hannover (Lavongai), Neu-Lauenburg, Neu-Pommern, Salomon Inseln i.G. @de
note: shFolderCount: 29
NotationLong: D 011
sh folder count: 29
type: Concept
in scheme: geo
notation: D11