Africa
notation: C1
label: Afrika @de
type: Concept
narrower: British Somaliland

British Somaliland
NotationLong: C 121
in scheme: geo
wa folder count: 2
notation: C121
subject of: about
gnd identifier: 4090132-4
gnd identifier: 4077509-4
broader: Africa
preferred label: Britisch-Somaliland @de
type: Concept
scope note: nordwestliches Gebiet des heutigen Somalia, zusammen mit Italienisch-Somaliland das heutige Somalia @de
wikipedia article: British Somaliland
wikipedia article: Britisch-Somaliland
note: waFolderCount: 2

NotationLong
sub property of: notation
definition: EXPERIMENTAL: Notation with blanks and leading zeros for sortability.