Africa
notation: C1
label: Afrika @de
type: Concept
narrower: Italian East Africa

NotationLong
sub property of: notation
definition: EXPERIMENTAL: Notation with blanks and leading zeros for sortability.

Italian East Africa
in scheme: geo
NotationLong: C 119
preferred label: Italienisch-Ostafrika @de
scope note: Italienisch Ostafrika (Eritrea und die äthiopische Provinz Tigre, 1936-1941), britische Verwaltung (1941-1952),Teil Äthipiens (1952- 1991), Eritrea (ab 1991 Übergangregierung, ab 1993 unabhängig) @de
subject of: about
gnd identifier: 4015278-9
gnd identifier: 4208732-6
gnd identifier: 4666871-8
type: Concept
wa folder count: 11
broader: Africa
wikipedia article: Italian East Africa
wikipedia article: Italienisch-Ostafrika
note: waFolderCount: 11
notation: C119