Africa
notation: C1
label: Afrika @de
type: Concept
narrower: Kenya

Kenya
label: Kenia @de
in scheme: geo
type: Concept
scope note: Britisch Ostafrika i.G., Kenya, Prot. Kenia (ab 2.5.1945) @de
NotationLong: C 116
wikipedia article: Kenya
wikipedia article: Kenia
folders complete: F
note: waFolderCount: 10
note: shFolderCount: 2
wa folder count: 10
broader: Africa
gnd identifier: 4030236-2
subject of: about
notation: C116
sh folder count: 2

NotationLong
sub property of: notation
definition: EXPERIMENTAL: Notation with blanks and leading zeros for sortability.