Africa
notation: C1
label: Afrika @de
type: Concept
narrower: German East Africa

German East Africa
folders complete: Y
note: shFolderCount: 248
note: waFolderCount: 13
preferred label: Deutsch-Ostafrika @de
wa folder count: 13
gnd identifier: 4011926-9
gnd identifier: 7622721-2
NotationLong: C 110
wikipedia article: German East Africa
wikipedia article: Deutsch-Ostafrika
type: Concept
in scheme: geo
subject of: about
sh folder count: 248
notation: C110
scope note: Deutsch Ostafrika (1891-1920), Tanganyika territory (ab 1920 brit. Mandat), Republik Tanganyika (1962-64), mit Sansibar zusammengeschlossen zu Vereinigter Republik von Tansania @de
broader: Africa

NotationLong
sub property of: notation
definition: EXPERIMENTAL: Notation with blanks and leading zeros for sortability.