Africa
notation: C1
label: Afrika @de
type: Concept
narrower: Swaziland

NotationLong
sub property of: notation
definition: EXPERIMENTAL: Notation with blanks and leading zeros for sortability.

Swaziland
wikipedia article: Eswatini
gnd identifier: 4058692-3
folders complete: F
in scheme: geo
scope note: Königreich, britisches Protektorat, ab 1968 unabhängig @de
wa folder count: 2
sh folder count: 1
NotationLong: C 097
broader: Africa
note: waFolderCount: 2
note: shFolderCount: 1
subject of: about
type: Concept
notation: C97