Africa
notation: C1
label: Afrika @de
type: Concept
narrower: Union of South Africa

Union of South Africa
note: shFolderCount: 22
note: waFolderCount: 43
wikipedia article: Südafrikanische Union
wikipedia article: Union of South Africa
subject of: about
notation: C93
sh folder count: 22
preferred label: Britisch-Südafrika @de
gnd identifier: 16299861-2
gnd identifier: 4078012-0
broader: Africa
in scheme: geo
NotationLong: C 093
type: Concept
folders complete: N
wa folder count: 43
scope note: Britisch Südafrika, Südafrikanische Union (ab 2.5.1910), Südafrikanische Republik (ab 1961) @de

NotationLong
sub property of: notation
definition: EXPERIMENTAL: Notation with blanks and leading zeros for sortability.