Africa
notation: C1
label: Afrika @de
type: Concept
narrower: Central African Republic

NotationLong
sub property of: notation
definition: EXPERIMENTAL: Notation with blanks and leading zeros for sortability.

Central African Republic
wikipedia article: Zentralafrikanische Republik
wikipedia article: Central African Republic
type: Concept
notation: C79
in scheme: geo
preferred label: Zentralafrikanische Republik @de
gnd identifier: 4067608-0
NotationLong: C 079
scope note: Zentralafrikanische Republik, Zentralafrikanisches Kaiserreich (ab 1976) @de
subject of: about
broader: Africa