Africa
notation: C1
label: Afrika @de
type: Concept
narrower: Spanish Guinea

NotationLong
sub property of: notation
definition: EXPERIMENTAL: Notation with blanks and leading zeros for sortability.

Spanish Guinea
NotationLong: C 070
scope note: Spanisch Guinea mit Fernando Po u. Dependenzen, Äquatorial-Guinea (ab 12.10.1968) @de
notation: C70
folders complete: Y
in scheme: geo
wa folder count: 3
label: Spanisch-Guinea @de
note: shFolderCount: 43
note: waFolderCount: 3
wikipedia article: Spanish Guinea
wikipedia article: Spanisch-Guinea
gnd identifier: 4068436-2
sh folder count: 43
broader: Africa
type: Concept
subject of: about