Africa
notation: C1
label: Afrika @de
type: Concept
narrower: Portuguese Guinea

NotationLong
sub property of: notation
definition: EXPERIMENTAL: Notation with blanks and leading zeros for sortability.

Portuguese Guinea
broader: Africa
in scheme: geo
wikipedia article: Portuguese Guinea
scope note: Portugiesisch Guinea, Guinea-Bissau (ab 1.9.1974) @de
subject of: about
preferred label: Portugiesisch-Guinea @de
note: waFolderCount: 3
type: Concept
notation: C52
gnd identifier: 4022522-7
NotationLong: C 052
wa folder count: 3