Africa
notation: C1
label: Afrika @de
type: Concept
narrower: French Guinea

NotationLong
sub property of: notation
definition: EXPERIMENTAL: Notation with blanks and leading zeros for sortability.

French Guinea
label: Französisch-Guinea @de
gnd identifier: 4022520-3
scope note: Französisch-Guine (1893-1958), Guinea (ab 1958) @de
type: Concept
notation: C36
wikipedia article: French Guinea
in scheme: geo
subject of: about
NotationLong: C 036
broader: Africa
wa folder count: 3
note: waFolderCount: 3