NotationLong
sub property of: notation
definition: EXPERIMENTAL: Notation with blanks and leading zeros for sortability.

Weihaiwei under British rule
folders complete: Y
subject of: about
scope note: 1898 an England verpachtet, bis 30.9.1930, dann China (B 94), @de
preferred label: Weihaiwei @de
type: Concept
NotationLong: B 110
wikipedia article: British Weihaiwei
sh folder count: 10
notation: B110
in scheme: geo
note: shFolderCount: 10
gnd identifier: 7580488-8
broader: Asia

Asia
notation: B1
label: Asien @de
type: Concept
narrower: Weihaiwei under British rule