NotationLong
sub property of: notation
definition: EXPERIMENTAL: Notation with blanks and leading zeros for sortability.

Asia
notation: B1
label: Asien @de
type: Concept
narrower: Saudi Arabia

Saudi Arabia
type: Concept
broader: Asia
preferred label: Saudi-Arabien @de
in scheme: geo
gnd identifier: 4210617-5
gnd identifier: 4051788-3
notation: B32
wikipedia article: Saudi Arabia
wikipedia article: Saudi-Arabien
scope note: Nadschd ist eine Landschaft und Provinz im Inneren Saudi-Arabiens, früher Saudi-arabisches Teilkönigreich, ehem Reich der Wahabiten. Siehe auch: Hedschas @de
NotationLong: B 032
subject of: about