NotationLong
sub property of: notation
definition: EXPERIMENTAL: Notation with blanks and leading zeros for sortability.

Asia
notation: B1
label: Asien @de
type: Concept
narrower: Hadhramaut

Hadhramaut
label: Hadramaut @de
subject of: about
notation: B30
NotationLong: B 030
type: Concept
broader: Asia
scope note: Region im Südosten der Republik Jemen @de
in scheme: geo
gnd identifier: 4022765-0
gnd identifier: 4073009-8