NotationLong
sub property of: notation
definition: EXPERIMENTAL: Notation with blanks and leading zeros for sortability.

Asia
notation: B1
label: Asien @de
type: Concept
narrower: United Arab Emirates

United Arab Emirates
in scheme: geo
subject of: about
label: Vereinigte Arabische Emirate @de
notation: B26
wikipedia article: United Arab Emirates
wikipedia article: Vereinigte Arabische Emirate
type: Concept
broader: Asia
scope note: (einschl.: Vereinigte Arabische Republiken, Djebel Schammar Emirat) @de
NotationLong: B 026
gnd identifier: 4062742-1