Kaukasien
wikipedia article: Caucasus
wikipedia article: Kaukasien
broader: Asien
scope note: Länder im Bereich u. mit Anteil am Kaukasus
editorial note: bis 30.06.1931, dann Sowjetunion (Asiatischer Teil) B 010
in scheme: geo
preferred label: Caucasus @en
wa folder count: 5
NotationLong: B 016
type: Concept
gnd identifier: 4448813-0
subject of: about
note: waFolderCount: 5
notation: B16

NotationLong
sub property of: notation
definition: EXPERIMENTAL: Notation with blanks and leading zeros for sortability. @en

Asien
notation: B1
label: Asia @en
type: Concept
narrower: Kaukasien